Reaction Details
TargetAdenosine receptor A2b
LigandBDBM191826
Substrate/Competitorn/a
Meas. Tech.Luciferase Assay
pH7.4±n/a
Temperature310.15±n/a K
EC50 169±n/a nM
Commentsextracted
Citation Vakalopoulos, AMeibom, DNell, PSussmeier, FAlbrecht-Kupper, BZimmermann, KKeldenich, JSchneider, DKrenz, U Substituted dicyanopyridines and use thereof US Patent US9187428 Publication Date 11/17/2015
 
Adenosine receptor A2b
Name:Adenosine receptor A2b
Type:G Protein-Coupled Receptor (GPCR)
Mol. Mass.:36341.22
Organism:Homo sapiens (Human)
Description:n/a
Residue:332
BDBM191826
NameBDBM191826
Synonyms:US9187428, 54
TypeSmall organic molecule
Emp. Form.C23H21N7O2S
Mol. Mass.459.524
SMILESCNC(=O)c1cc(CSc2nc(N)c(C#N)c(-c3ccc(OCCN)cc3)c2C#N)ccn1