Reaction Details
TargetCannabinoid receptor 1
LigandBDBM192526
Substrate/Competitorn/a
Meas. Tech.Radioligand Displacement Assay (CP55940)
Ki 6.21±n/a nM
Citation Maitra, RFulp, ABZhang, YSeltzman, HH Peripherally restricted diphenyl purine derivatives US Patent US9187480 Publication Date 11/17/2015
 
Cannabinoid receptor 1
Name:Cannabinoid receptor 1
Type:G Protein-Coupled Receptor (GPCR)
Mol. Mass.:52868.96
Organism:Homo sapiens (Human)
Description:P21554
Residue:472
BDBM192526
NameBDBM192526
Synonyms:US9187480, N-{4-[8-(2-chlorophenyl)-9-(4-chlorophenyl)-9H-purin-6-yl]-1-phenylcyclohexyl}methanesulfonamide
TypeSmall organic molecule
Emp. Form.C30H27Cl2N5O2S
Mol. Mass.592.539
SMILESCS(=O)(=O)NC1(CCC(CC1)c1ncnc2n(c(nc12)-c1ccccc1Cl)-c1ccc(Cl)cc1)c1ccccc1