Reaction Details
TargetCannabinoid receptor 1
LigandBDBM192531
Substrate/Competitorn/a
Meas. Tech.Radioligand Displacement Assay (CP55940)
Ki 6.1±n/a nM
Citation Maitra, RFulp, ABZhang, YSeltzman, HH Peripherally restricted diphenyl purine derivatives US Patent US9187480 Publication Date 11/17/2015
 
Cannabinoid receptor 1
Name:Cannabinoid receptor 1
Type:G Protein-Coupled Receptor (GPCR)
Mol. Mass.:52868.96
Organism:Homo sapiens (Human)
Description:P21554
Residue:472
BDBM192531
NameBDBM192531
Synonyms:US9187480, 8-(2-chlorophenyl)-9-(4-chlorophenyl)-6-[4-(trifluoromethanesulfonylmethyl)piperidin-1-yl]-9H-purine
TypeSmall organic molecule
Emp. Form.C23H19Cl2F3N6O2S
Mol. Mass.571.402
SMILESFC(F)(F)S(=O)(=O)NC1CCN(CC1)c1ncnc2n(c(nc12)-c1ccccc1Cl)-c1ccc(Cl)cc1