Reaction Details
TargetCannabinoid receptor 1
LigandBDBM192532
Substrate/Competitorn/a
Meas. Tech.Radioligand Displacement Assay (CP55940)
Ki 3.35±n/a nM
Citation Maitra, RFulp, ABZhang, YSeltzman, HH Peripherally restricted diphenyl purine derivatives US Patent US9187480 Publication Date 11/17/2015
 
Cannabinoid receptor 1
Name:Cannabinoid receptor 1
Type:G Protein-Coupled Receptor (GPCR)
Mol. Mass.:52868.96
Organism:Homo sapiens (Human)
Description:P21554
Residue:472
BDBM192532
NameBDBM192532
Synonyms:US9187480, N-{1-[8-(2-chlorophenyl)-9-(4-chlorophenyl)-9H-purin-6-yl]piperidin-4-yl}cyclohexanecarboxamide
TypeSmall organic molecule
Emp. Form.C29H30Cl2N6O
Mol. Mass.549.494
SMILESClc1ccc(cc1)-n1c(nc2c(ncnc12)N1CCC(CC1)NC(=O)C1CCCCC1)-c1ccccc1Cl