Reaction Details
TargetPhosphatidylinositol 4,5-bisphosphate 3-kinase catalytic subunit delta isoform
LigandBDBM261171
Substrate/Competitorn/a
Meas. Tech.PI3K delta Scintillation Proximity Assay
pH6.7±n/a
Temperature298.15±n/a K
IC50<10±n/a nM
Commentsextracted
Citation Li, YYao, WCombs, APYue, EWMei, SZhu, WGlenn, JMaduskuie, Jr., TPSparks, RBDouty, BHe, C Heterocyclylamines as PI3K inhibitors US Patent US10092570 Publication Date 10/9/2018
 
Phosphatidylinositol 4,5-bisphosphate 3-kinase catalytic subunit delta isoform
Name:Phosphatidylinositol 4,5-bisphosphate 3-kinase catalytic subunit delta isoform
Type:Enzyme Subunit
Mol. Mass.:119489.41
Organism:Homo sapiens (Human)
Description:O00329
Residue:1044
BDBM261171
NameBDBM261171
Synonyms:US10092570, Example 194 US9707233, 194 {3-[1-(4-Amino-3-methyl-1H-pyrazolo[3,4-d]pyrimidin-1-yl)ethyl]-5-chloro-2-methoxy-6-methylphenyl}acetonitrile
TypeSmall organic molecule
Emp. Form.C18H21ClN6O
Mol. Mass.372.852
SMILESCOc1c(CC#N)c(C)c(Cl)cc1C(C)Nc1ncnc(N)c1C(C)=N