Reaction Details
TargetLysine-specific demethylase 5C
LigandBDBM60875
Substrate/Competitorn/a
Meas. Tech.KDM5 TR-FRET Assay
pH7±n/a
IC50 1200±n/a nM
Commentsextracted
Citation Vinogradova, MGehling, VSGustafson, AArora, STindell, CAWilson, CWilliamson, KEGuler, GDGangurde, PManieri, WBusby, JFlynn, EMLan, FKim, HJOdate, SCochran, AGLiu, YWongchenko, MYang, YCheung, TKMaile, TMLau, TCosta, MHegde, GVJackson, EPitti, RArnott, DBailey, CBellon, SCummings, RTAlbrecht, BKHarmange, JCKiefer, JRTrojer, PClasson, M An inhibitor of KDM5 demethylases reduces survival of drug-tolerant cancer cells. Nat Chem Biol12:531-8 (2016) 
 
Lysine-specific demethylase 5C
Name:Lysine-specific demethylase 5C
Type:PROTEIN
Mol. Mass.:175691.17
Organism:Homo sapiens (Human)
Description:P41229
Residue:1560
BDBM60875
NameBDBM60875
Synonyms:3-((6-(4,5-Dihydro-1H-benzo[d]azepin-3(2H)-yl)-2-(pyridin-2-yl)pyrimidin-4-yl)amino)propanoic acid GSK J1 GSKJ1
Typen/a
Emp. Form.C22H23N5O2
Mol. Mass.389.4503
SMILESOC(=O)CCNc1cc(nc(n1)-c1ccccn1)N1CCc2ccccc2CC1