Reaction Details
TargetProlactin-releasing peptide receptor
LigandBDBM195627
Substrate/Competitorn/a
Meas. Tech.Inhibition Assay
pH7.4±n/a
Temperature298.15±n/a K
Ki 8±n/a nM
Commentsextracted
Citation Takahashi, ASuzuki, MNakamura, YSakurai, Y Heterocyclic compounds for the treatment of stress-related conditions US Patent US9206173 Publication Date 12/8/2015
 
Prolactin-releasing peptide receptor
Name:Prolactin-releasing peptide receptor
Type:Protein
Mol. Mass.:41138.32
Organism:Homo sapiens (Human)
Description:P49683
Residue:370
BDBM195627
NameBDBM195627
Synonyms:US9206173, 2389
TypeSmall organic molecule
Emp. Form.C25H24ClF3N4O4
Mol. Mass.536.931
SMILESCOn1c(NC(C)c2ccc(cc2)C(F)(F)F)nc2CCN(Cc2c1=O)C(=O)COc1ccc(Cl)cc1