Reaction Details
TargetProlactin-releasing peptide receptor
LigandBDBM195656
Substrate/Competitorn/a
Meas. Tech.Inhibition Assay
pH7.4±n/a
Temperature298.15±n/a K
Ki 8±n/a nM
Commentsextracted
Citation Takahashi, ASuzuki, MNakamura, YSakurai, Y Heterocyclic compounds for the treatment of stress-related conditions US Patent US9206173 Publication Date 12/8/2015
 
Prolactin-releasing peptide receptor
Name:Prolactin-releasing peptide receptor
Type:Protein
Mol. Mass.:41138.32
Organism:Homo sapiens (Human)
Description:P49683
Residue:370
BDBM195656
NameBDBM195656
Synonyms:US9206173, 2418
TypeSmall organic molecule
Emp. Form.C27H24F3N5O3
Mol. Mass.523.5064
SMILESCOn1c(NC(C)c2ccc(cc2)C(F)(F)F)nc2CCN(Cc2c1=O)C(=O)c1cnc2ccccc2c1