Reaction Details
TargetProlactin-releasing peptide receptor
LigandBDBM195657
Substrate/Competitorn/a
Meas. Tech.Inhibition Assay
pH7.4±n/a
Temperature298.15±n/a K
Ki 7±n/a nM
Commentsextracted
Citation Takahashi, ASuzuki, MNakamura, YSakurai, Y Heterocyclic compounds for the treatment of stress-related conditions US Patent US9206173 Publication Date 12/8/2015
 
Prolactin-releasing peptide receptor
Name:Prolactin-releasing peptide receptor
Type:Protein
Mol. Mass.:41138.32
Organism:Homo sapiens (Human)
Description:P49683
Residue:370
BDBM195657
NameBDBM195657
Synonyms:US9206173, 2419
TypeSmall organic molecule
Emp. Form.C25H26F3N5O5
Mol. Mass.533.4996
SMILESCOc1ccc(C(=O)N2CCc3nc(NC(C)c4ccc(cc4)C(F)(F)F)n(OC)c(=O)c3C2)c(OC)n1