Reaction Details
TargetProlactin-releasing peptide receptor
LigandBDBM195673
Substrate/Competitorn/a
Meas. Tech.Inhibition Assay
pH7.4±n/a
Temperature298.15±n/a K
Ki 2±n/a nM
Commentsextracted
Citation Takahashi, ASuzuki, MNakamura, YSakurai, Y Heterocyclic compounds for the treatment of stress-related conditions US Patent US9206173 Publication Date 12/8/2015
 
Prolactin-releasing peptide receptor
Name:Prolactin-releasing peptide receptor
Type:Protein
Mol. Mass.:41138.32
Organism:Homo sapiens (Human)
Description:P49683
Residue:370
BDBM195673
NameBDBM195673
Synonyms:US9206173, 2435
TypeSmall organic molecule
Emp. Form.C28H23F4N5O2
Mol. Mass.537.5081
SMILESC[C@H](Nc1nc2CCN(Cc2c(=O)n1CCC#C)C(=O)c1ccc(cc1F)C#N)c1ccc(cc1)C(F)(F)F