Reaction Details
TargetProlactin-releasing peptide receptor
LigandBDBM195720
Substrate/Competitorn/a
Meas. Tech.Inhibition Assay
pH7.4±n/a
Temperature298.15±n/a K
Ki 8±n/a nM
Commentsextracted
Citation Takahashi, ASuzuki, MNakamura, YSakurai, Y Heterocyclic compounds for the treatment of stress-related conditions US Patent US9206173 Publication Date 12/8/2015
 
Prolactin-releasing peptide receptor
Name:Prolactin-releasing peptide receptor
Type:Protein
Mol. Mass.:41138.32
Organism:Homo sapiens (Human)
Description:P49683
Residue:370
BDBM195720
NameBDBM195720
Synonyms:US9206173, 2482
TypeSmall organic molecule
Emp. Form.C26H23F4N5O3
Mol. Mass.529.4861
SMILESCCC(Nc1nc2CCN(Cc2c(=O)n1OC)C(=O)c1ccc(cc1F)C#N)c1ccc(cc1)C(F)(F)F