Reaction Details
TargetGenome polyprotein
LigandBDBM196124
Substrate/Competitorn/a
Meas. Tech.Protease Assay
IC50<0.3±n/a nM
Citation Brandl, TRaman, PRigollier, PSeepersaud, MSimic, O Organic compounds and their uses US Patent US9206232 Publication Date 12/8/2015
 
Genome polyprotein
Name:Genome polyprotein
Type:Protease Domain
Mol. Mass.:327221.49
Organism:Hepatitis C virus (HCV genotype 1a, isolate H)
Description:P27958
Residue:3011
BDBM196124
NameBDBM196124
Synonyms:US9206232, 125
TypeSmall organic molecule
Emp. Form.C46H73N7O8S
Mol. Mass.884.179
SMILESCC(C)N1CCC[C@H]1C(=O)N[C@@H](C1CCCCC1)C(=O)N[C@H](C(=O)N1C[C@]2(C[C@H]1C(=O)N[C@@]1(C[C@H]1C=C)C(=O)NS(=O)(=O)N1CCCC1)C(C)(C)C21CCC1)C1(C)CCOCC1