Reaction Details
TargetALK tyrosine kinase receptor
LigandBDBM196860
Substrate/Competitorn/a
Meas. Tech.Enzyme Inhibition Assay
pH7.4±n/a
Temperature298.15±n/a K
Ki 5±n/a nM
Commentsextracted
Citation Vasudevan, APenning, TDChen, HLiang, BWang, SWu, FShen, YLiu, CZou, ZPliushchev, M Bicyclic carboxamide inhibitors of kinases US Patent US9212192 Publication Date 12/15/2015
 
ALK tyrosine kinase receptor
Name:ALK tyrosine kinase receptor
Type:Protein
Mol. Mass.:176453.10
Organism:Homo sapiens (Human)
Description:Q9UM73
Residue:1620
BDBM196860
NameBDBM196860
Synonyms:US9212192, 23
TypeSmall organic molecule
Emp. Form.C27H27Cl2N7O3
Mol. Mass.568.454
SMILESCOc1cc(ccc1Nc1nc(Cc2c(Cl)cccc2Cl)n2ccnc2c1C(N)=O)C(=O)N1CCN(C)CC1