Reaction Details
TargetALK tyrosine kinase receptor
LigandBDBM196898
Substrate/Competitorn/a
Meas. Tech.Enzyme Inhibition Assay
pH7.4±n/a
Temperature298.15±n/a K
Ki 11±n/a nM
Commentsextracted
Citation Vasudevan, APenning, TDChen, HLiang, BWang, SWu, FShen, YLiu, CZou, ZPliushchev, M Bicyclic carboxamide inhibitors of kinases US Patent US9212192 Publication Date 12/15/2015
 
ALK tyrosine kinase receptor
Name:ALK tyrosine kinase receptor
Type:Protein
Mol. Mass.:176453.10
Organism:Homo sapiens (Human)
Description:Q9UM73
Residue:1620
BDBM196898
NameBDBM196898
Synonyms:US9212192, 61
TypeSmall organic molecule
Emp. Form.C26H29ClN8O2
Mol. Mass.521.014
SMILESCCc1nnc2c(C(N)=O)c(Nc3ccc(cc3OC)N3CCNCC3)nc(Cc3ccccc3Cl)n12