Reaction Details
TargetALK tyrosine kinase receptor
LigandBDBM196900
Substrate/Competitorn/a
Meas. Tech.Enzyme Inhibition Assay
pH7.4±n/a
Temperature298.15±n/a K
Ki 8±n/a nM
Commentsextracted
Citation Vasudevan, APenning, TDChen, HLiang, BWang, SWu, FShen, YLiu, CZou, ZPliushchev, M Bicyclic carboxamide inhibitors of kinases US Patent US9212192 Publication Date 12/15/2015
 
ALK tyrosine kinase receptor
Name:ALK tyrosine kinase receptor
Type:Protein
Mol. Mass.:176453.10
Organism:Homo sapiens (Human)
Description:Q9UM73
Residue:1620
BDBM196900
NameBDBM196900
Synonyms:US9212192, 63
TypeSmall organic molecule
Emp. Form.C25H26FN7O2
Mol. Mass.475.518
SMILESCOc1cc(ccc1Nc1nc(Cc2ccccc2F)n2cnnc2c1C(N)=O)C1CCNCC1