Reaction Details
TargetALK tyrosine kinase receptor
LigandBDBM196901
Substrate/Competitorn/a
Meas. Tech.Enzyme Inhibition Assay
pH7.4±n/a
Temperature298.15±n/a K
Ki 6±n/a nM
Commentsextracted
Citation Vasudevan, APenning, TDChen, HLiang, BWang, SWu, FShen, YLiu, CZou, ZPliushchev, M Bicyclic carboxamide inhibitors of kinases US Patent US9212192 Publication Date 12/15/2015
 
ALK tyrosine kinase receptor
Name:ALK tyrosine kinase receptor
Type:Protein
Mol. Mass.:176453.10
Organism:Homo sapiens (Human)
Description:Q9UM73
Residue:1620
BDBM196901
NameBDBM196901
Synonyms:US9212192, 64
TypeSmall organic molecule
Emp. Form.C25H25F2N7O2
Mol. Mass.493.5085
SMILESCOc1cc(ccc1Nc1nc(Cc2cccc(F)c2F)n2cnnc2c1C(N)=O)C1CCNCC1