Reaction Details
TargetALK tyrosine kinase receptor
LigandBDBM196904
Substrate/Competitorn/a
Meas. Tech.Enzyme Inhibition Assay
pH7.4±n/a
Temperature298.15±n/a K
Ki 13±n/a nM
Commentsextracted
Citation Vasudevan, APenning, TDChen, HLiang, BWang, SWu, FShen, YLiu, CZou, ZPliushchev, M Bicyclic carboxamide inhibitors of kinases US Patent US9212192 Publication Date 12/15/2015
 
ALK tyrosine kinase receptor
Name:ALK tyrosine kinase receptor
Type:Protein
Mol. Mass.:176453.10
Organism:Homo sapiens (Human)
Description:Q9UM73
Residue:1620
BDBM196904
NameBDBM196904
Synonyms:US9212192, 67
TypeSmall organic molecule
Emp. Form.C28H30Cl2N8O3
Mol. Mass.597.496
SMILESCCNC(=O)c1cn2c(Cc3c(Cl)cccc3Cl)nc(Nc3ccc(cc3OC)N3CCNCC3)c(C(N)=O)c2n1