Reaction Details
TargetAdenosine receptor A2a
LigandBDBM21173
Substrate/Competitorn/a
Meas. Tech.A2A Adenosine Receptor Binding Assay
pH7.4±n/a
Temperature298.15±n/a K
Ki 337±28 nM
Commentsextracted
Citation Cosimelli, BGreco, GLaneri, SNovellino, ESacchi, ATrincavelli, MLGiacomelli, CTaliani, SDa Settimo, FMartini, C 4-amino-6-alkyloxy-2-alkylthiopyrimidine derivatives as novel non-nucleoside agonists for the adenosine A1 receptor. Chem Biol Drug Des88:724-729 (2016) 
 
Adenosine receptor A2a
Name:Adenosine receptor A2a
Type:G Protein-Coupled Receptor (GPCR)
Mol. Mass.:44716.46
Organism:Homo sapiens (Human)
Description:P29274
Residue:412
BDBM21173
NameBDBM21173
Synonyms:1,3-dipropyl-8-cyclopentylxanthine CHEMBL183 PD116948 | [3H]DPCPX
Typeradiolabeled ligand
Emp. Form.C16H24N4O2
Mol. Mass.304.3874
SMILESCCCn1c2nc([nH]c2c(=O)n(CCC)c1=O)C1CCCC1