Reaction Details
TargetLow molecular weight phosphotyrosine protein phosphatase
LigandBDBM199180
Substrate/Competitorn/a
Meas. Tech.PTP pNPP Assay
pH7±n/a
Temperature298.15±n/a K
Ki>1000±0.0 nM
Commentsextracted
Citation Zhang, ZZhang, S Inhibitors of protein tyrosine phosphatases US Patent US9217012 Publication Date 12/22/2015
 
Low molecular weight phosphotyrosine protein phosphatase
Name:Low molecular weight phosphotyrosine protein phosphatase
Type:n/a
Mol. Mass.:18042.81
Organism:Homo sapiens (Human)
Description:P24666
Residue:158
BDBM199180
NameBDBM199180
Synonyms:US9217012, 10
TypeSmall organic molecule
Emp. Form.C46H62F2N5O9P
Mol. Mass.897.9831
SMILESCCc1ccc(cc1)C(=O)NCCCCC(NC(=O)C(Cc1ccc(cc1)C(F)(F)P(O)(O)=O)NC(=O)C(Cc1ccccc1)NC(=O)COC1CC(C)CCC1C(C)C)C(N)=O