Reaction Details
TargetMitogen-activated protein kinase 1
LigandBDBM199574
Substrate/Competitorn/a
Meas. Tech.IMAP-FP Assay
IC50 0.5±n/a nM
Citation Wilson, KJWitter, DJDaniels, MHAngeles, ARSiliphaivanh, PSloman, DO'Boyle, BFalcone, DWhite, CFerguson, RZhou, WLipford, KMansoor, UFFevrier, SHuang, XKurukulasuriya, RRichard, JETang, SBoyce, CKozlowski, JBakshi, RKKarunakaran, GB Compounds that are ERK inhibitors US Patent US9226922 Publication Date 1/5/2016
 
Mitogen-activated protein kinase 1
Name:Mitogen-activated protein kinase 1
Type:Ser/Thr Protein Kinase
Mol. Mass.:41392.76
Organism:Homo sapiens (Human)
Description:P28482
Residue:360
BDBM199574
NameBDBM199574
Synonyms:US9226922, 210
TypeSmall organic molecule
Emp. Form.C19H22FN5O5
Mol. Mass.419.4069
SMILESC[C@@H](O)[C@@H](NC(=O)Nc1cc2[nH]nc(OCCO)c2c(CO)n1)c1ccc(F)cc1