Reaction Details
TargetMitogen-activated protein kinase 1
LigandBDBM199828
Substrate/Competitorn/a
Meas. Tech.IMAP-FP Assay
IC50 0.3±n/a nM
Citation Wilson, KJWitter, DJDaniels, MHAngeles, ARSiliphaivanh, PSloman, DO'Boyle, BFalcone, DWhite, CFerguson, RZhou, WLipford, KMansoor, UFFevrier, SHuang, XKurukulasuriya, RRichard, JETang, SBoyce, CKozlowski, JBakshi, RKKarunakaran, GB Compounds that are ERK inhibitors US Patent US9226922 Publication Date 1/5/2016
 
Mitogen-activated protein kinase 1
Name:Mitogen-activated protein kinase 1
Type:Ser/Thr Protein Kinase
Mol. Mass.:41392.76
Organism:Homo sapiens (Human)
Description:P28482
Residue:360
BDBM199828
NameBDBM199828
Synonyms:US9226922, 464
TypeSmall organic molecule
Emp. Form.C19H22FN5O4
Mol. Mass.403.4075
SMILESCCOc1n[nH]c2cc(NC(=O)N[C@H]([C@@H](C)O)c3ccc(F)cc3)nc(CO)c12