Reaction Details
Target6-phosphofructo-2-kinase/fructose-2,6-bisphosphatase 3
LigandBDBM200906
Substrate/Competitorn/a
Meas. Tech.Kinase Assay (Method A)
IC50 30±n/a nM
Citation Bystrom, SHedgecock, CHoman, ELundback, TMartinsson, JSari, MFarnegardh, KJonsson, M Sulfonamide compounds US Patent US9233946 Publication Date 1/12/2016
 
6-phosphofructo-2-kinase/fructose-2,6-bisphosphatase 3
Name:6-phosphofructo-2-kinase/fructose-2,6-bisphosphatase 3
Type:Enzyme
Mol. Mass.:59620.59
Organism:Homo sapiens (Human)
Description:Q16875
Residue:520
BDBM200906
NameBDBM200906
Synonyms:US9233946, 5
TypeSmall organic molecule
Emp. Form.C19H19NO4S2
Mol. Mass.389.488
SMILESCC(C)c1ccc2sc(c(C)c2c1)S(=O)(=O)Nc1cccc(c1)C(O)=O