Reaction Details
Target6-phosphofructo-2-kinase/fructose-2,6-bisphosphatase 4
LigandBDBM200919
Substrate/Competitorn/a
Meas. Tech.Kinase Assay (Method B)
IC50 510±n/a nM
Citation Bystrom, SHedgecock, CHoman, ELundback, TMartinsson, JSari, MFarnegardh, KJonsson, M Sulfonamide compounds US Patent US9233946 Publication Date 1/12/2016
 
6-phosphofructo-2-kinase/fructose-2,6-bisphosphatase 4
Name:6-phosphofructo-2-kinase/fructose-2,6-bisphosphatase 4
Type:Enzyme
Mol. Mass.:54039.68
Organism:Homo sapiens (Human)
Description:Q16877
Residue:469
BDBM200919
NameBDBM200919
Synonyms:US9233946, 18
TypeSmall organic molecule
Emp. Form.C14H8Cl2F3N5O2S
Mol. Mass.438.212
SMILESFC(F)(F)c1cc(Cl)c(c(Cl)c1)S(=O)(=O)Nc1cccc(c1)-c1nnn[nH]1