Reaction Details
Target6-phosphofructo-2-kinase/fructose-2,6-bisphosphatase 4
LigandBDBM200941
Substrate/Competitorn/a
Meas. Tech.Kinase Assay (Method B)
IC50 140±n/a nM
Citation Bystrom, SHedgecock, CHoman, ELundback, TMartinsson, JSari, MFarnegardh, KJonsson, M Sulfonamide compounds US Patent US9233946 Publication Date 1/12/2016
 
6-phosphofructo-2-kinase/fructose-2,6-bisphosphatase 4
Name:6-phosphofructo-2-kinase/fructose-2,6-bisphosphatase 4
Type:Enzyme
Mol. Mass.:54039.68
Organism:Homo sapiens (Human)
Description:Q16877
Residue:469
BDBM200941
NameBDBM200941
Synonyms:US9233946, 40
TypeSmall organic molecule
Emp. Form.C16H13N5O2S2
Mol. Mass.371.437
SMILESCc1ccc2sc(cc2c1)S(=O)(=O)Nc1cccc(c1)-c1nnn[nH]1