Reaction Details
Target6-phosphofructo-2-kinase/fructose-2,6-bisphosphatase 4
LigandBDBM201002
Substrate/Competitorn/a
Meas. Tech.Kinase Assay (Method B)
IC50 600±n/a nM
Citation Bystrom, SHedgecock, CHoman, ELundback, TMartinsson, JSari, MFarnegardh, KJonsson, M Sulfonamide compounds US Patent US9233946 Publication Date 1/12/2016
 
6-phosphofructo-2-kinase/fructose-2,6-bisphosphatase 4
Name:6-phosphofructo-2-kinase/fructose-2,6-bisphosphatase 4
Type:Enzyme
Mol. Mass.:54039.68
Organism:Homo sapiens (Human)
Description:Q16877
Residue:469
BDBM201002
NameBDBM201002
Synonyms:US9233946, 101
TypeSmall organic molecule
Emp. Form.C17H11F2N5O2S2
Mol. Mass.419.428
SMILESFc1ccc(-c2ccc(s2)S(=O)(=O)Nc2cccc(c2)-c2nnn[nH]2)c(F)c1