Reaction Details
TargetSodium- and chloride-dependent glycine transporter 1
LigandBDBM201057
Substrate/Competitorn/a
Meas. Tech.Cytostar-T Assay
IC50 4±n/a nM
Citation Hoenke, CGiovannini, RLessel, URosenbrock, HSchmid, B Derivatives of 4-(piperazinylcarbonyl)thiane-1, 1-dione which inhibit GlyT1 US Patent US9233953 Publication Date 1/12/2016
 
Sodium- and chloride-dependent glycine transporter 1
Name:Sodium- and chloride-dependent glycine transporter 1
Type:Enzyme
Mol. Mass.:78270.54
Organism:Homo sapiens (Human)
Description:P48067
Residue:706
BDBM201057
NameBDBM201057
Synonyms:US9233953, 18
TypeSmall organic molecule
Emp. Form.C20H20F5N3O4S
Mol. Mass.493.448
SMILESFc1cccc(C2CN(CCN2C(=O)C2CCS(=O)(=O)CC2)c2cc(on2)C(F)(F)F)c1F