Reaction Details
TargetSodium- and chloride-dependent glycine transporter 1
LigandBDBM201137
Substrate/Competitorn/a
Meas. Tech.Cytostar-T Assay
IC50 7±n/a nM
Citation Hoenke, CGiovannini, RLessel, URosenbrock, HSchmid, B Derivatives of 4-(piperazinylcarbonyl)thiane-1, 1-dione which inhibit GlyT1 US Patent US9233953 Publication Date 1/12/2016
 
Sodium- and chloride-dependent glycine transporter 1
Name:Sodium- and chloride-dependent glycine transporter 1
Type:Enzyme
Mol. Mass.:78270.54
Organism:Homo sapiens (Human)
Description:P48067
Residue:706
BDBM201137
NameBDBM201137
Synonyms:US9233953, 98
TypeSmall organic molecule
Emp. Form.C17H18F4N4O3S3
Mol. Mass.498.538
SMILESFc1ccc(s1)C1CN(CCN1C(=O)C1CCS(=O)(=O)CC1)c1nnc(s1)C(F)(F)F