Reaction Details
TargetSodium- and chloride-dependent glycine transporter 1
LigandBDBM201139
Substrate/Competitorn/a
Meas. Tech.Cytostar-T Assay
IC50 7±n/a nM
Citation Hoenke, CGiovannini, RLessel, URosenbrock, HSchmid, B Derivatives of 4-(piperazinylcarbonyl)thiane-1, 1-dione which inhibit GlyT1 US Patent US9233953 Publication Date 1/12/2016
 
Sodium- and chloride-dependent glycine transporter 1
Name:Sodium- and chloride-dependent glycine transporter 1
Type:Enzyme
Mol. Mass.:78270.54
Organism:Homo sapiens (Human)
Description:P48067
Residue:706
BDBM201139
NameBDBM201139
Synonyms:US9233953, 100
TypeSmall organic molecule
Emp. Form.C19H23FN4O3S2
Mol. Mass.438.539
SMILESCc1cnc(nc1)N1CCN(C(C1)c1ccc(F)s1)C(=O)C1CCS(=O)(=O)CC1