Reaction Details
TargetSodium- and chloride-dependent glycine transporter 1
LigandBDBM201162
Substrate/Competitorn/a
Meas. Tech.Cytostar-T Assay
IC50 3±n/a nM
Citation Hoenke, CGiovannini, RLessel, URosenbrock, HSchmid, B Derivatives of 4-(piperazinylcarbonyl)thiane-1, 1-dione which inhibit GlyT1 US Patent US9233953 Publication Date 1/12/2016
 
Sodium- and chloride-dependent glycine transporter 1
Name:Sodium- and chloride-dependent glycine transporter 1
Type:Enzyme
Mol. Mass.:78270.54
Organism:Homo sapiens (Human)
Description:P48067
Residue:706
BDBM201162
NameBDBM201162
Synonyms:US9233953, 122
TypeSmall organic molecule
Emp. Form.C22H25ClN2O3S
Mol. Mass.432.964
SMILESClc1ccc(cc1)N1CCN(C(C1)c1ccccc1)C(=O)C1CCS(=O)(=O)CC1