Reaction Details
TargetSodium- and chloride-dependent glycine transporter 1
LigandBDBM201197
Substrate/Competitorn/a
Meas. Tech.Cytostar-T Assay
IC50 8±n/a nM
Citation Hoenke, CGiovannini, RLessel, URosenbrock, HSchmid, B Derivatives of 4-(piperazinylcarbonyl)thiane-1, 1-dione which inhibit GlyT1 US Patent US9233953 Publication Date 1/12/2016
 
Sodium- and chloride-dependent glycine transporter 1
Name:Sodium- and chloride-dependent glycine transporter 1
Type:Enzyme
Mol. Mass.:78270.54
Organism:Homo sapiens (Human)
Description:P48067
Residue:706
BDBM201197
NameBDBM201197
Synonyms:US9233953, 159
TypeSmall organic molecule
Emp. Form.C20H23F3N4O3S2
Mol. Mass.488.547
SMILESCc1ccc(s1)C1CN(CCN1C(=O)C1CCS(=O)(=O)CC1)c1ncc(cn1)C(F)(F)F