Reaction Details
TargetTyrosine-protein kinase BTK
LigandBDBM202124
Substrate/Competitorn/a
Meas. Tech.Recombinant Human BTK Inhibition Assay
IC50 3±n/a nM
Citation Thakkar, MKoul, SBhuniya, DMookhtiar, KKurhade, SMunot, YMengawade, TKulkarni, BA Substituted hetero-bicyclic compounds, compositions and medicinal applications thereof US Patent US9233983 Publication Date 1/12/2016
 
Tyrosine-protein kinase BTK
Name:Tyrosine-protein kinase BTK
Type:Enzyme
Mol. Mass.:76289.95
Organism:Homo sapiens (Human)
Description:Q06187
Residue:659
BDBM202124
NameBDBM202124
Synonyms:US9233983, F-1
TypeSmall organic molecule
Emp. Form.C32H29N5O4
Mol. Mass.547.6038
SMILESOCc1c(cccc1-c1ccnc2[nH]c(cc12)-c1cnn(c1)C1COC1)N1CCOc2cc(ccc2C1=O)C1CC1