Reaction Details
TargetTyrosine-protein kinase BTK
LigandBDBM202141
Substrate/Competitorn/a
Meas. Tech.Recombinant Human BTK Inhibition Assay
IC50 2±n/a nM
Citation Thakkar, MKoul, SBhuniya, DMookhtiar, KKurhade, SMunot, YMengawade, TKulkarni, BA Substituted hetero-bicyclic compounds, compositions and medicinal applications thereof US Patent US9233983 Publication Date 1/12/2016
 
Tyrosine-protein kinase BTK
Name:Tyrosine-protein kinase BTK
Type:Enzyme
Mol. Mass.:76289.95
Organism:Homo sapiens (Human)
Description:Q06187
Residue:659
BDBM202141
NameBDBM202141
Synonyms:US9233983, I-12
TypeSmall organic molecule
Emp. Form.C38H39FN6O3
Mol. Mass.646.7531
SMILESCCN1CCN(Cc2ccc(nc2)-c2cc3c(ccnc3[nH]2)-c2cccc(N3CCOc4cc(cc(F)c4C3=O)C3CC3)c2CO)CC1