Reaction Details
TargetTyrosine-protein kinase BTK
LigandBDBM202199
Substrate/Competitorn/a
Meas. Tech.Recombinant Human BTK Inhibition Assay
IC50 1±n/a nM
Citation Thakkar, MKoul, SBhuniya, DMookhtiar, KKurhade, SMunot, YMengawade, TKulkarni, BA Substituted hetero-bicyclic compounds, compositions and medicinal applications thereof US Patent US9233983 Publication Date 1/12/2016
 
Tyrosine-protein kinase BTK
Name:Tyrosine-protein kinase BTK
Type:Enzyme
Mol. Mass.:76289.95
Organism:Homo sapiens (Human)
Description:Q06187
Residue:659
BDBM202199
NameBDBM202199
Synonyms:US9233983, P-14
TypeSmall organic molecule
Emp. Form.C34H34FN5O4
Mol. Mass.595.6633
SMILESCN(C)C(=O)N1CCC(=CC1)c1cc2c(ccnc2[nH]1)-c1cccc(N2CCOc3cc(cc(F)c3C2=O)C2CC2)c1CO