Reaction Details
TargetBeta-secretase 1
LigandBDBM202636
Substrate/Competitorn/a
Meas. Tech.Cellular Aβ-Lowering Assay
IC50 17±n/a nM
Citation Andreini, MGabellieri, EGuba, WHilpert, HMayweg, AVNarquizian, RPower, ETravagli, MWoltering, TWostl, WMauser, H 1,4 oxazines as BACE1 and/or BACE2 inhibitors US Patent US9242943 Publication Date 1/26/2016
 
Beta-secretase 1
Name:Beta-secretase 1
Type:Protein
Mol. Mass.:55755.10
Organism:Homo sapiens (Human)
Description:P56817
Residue:501
BDBM202636
NameBDBM202636
Synonyms:US9242943, 45
TypeSmall organic molecule
Emp. Form.C16H17ClF3N5O
Mol. Mass.387.787
SMILESC[C@]1(COCC(N)=N1)c1cc(NCc2nn(cc2Cl)C(F)F)ccc1F