Reaction Details
TargetMitogen-activated protein kinase 1
LigandBDBM204188
Substrate/Competitorn/a
Meas. Tech.ERK2 (20 pM) Kinase Assay
pH7.5±n/a
IC50 0.014±n/a nM
Commentsextracted
Citation Bagdanoff, JTDing, YHan, WHuang, ZJiang, QJin, JXKou, XLee, PLindvall, MMin, ZPan, YPecchi, SPfister, KBPoon, DRauniyar, VWang, XMZhang, QZhou, JZhu, S Aminoheteroaryl benzamides as kinase inhibitors US Patent US9242996 Publication Date 1/26/2016
 
Mitogen-activated protein kinase 1
Name:Mitogen-activated protein kinase 1
Type:Ser/Thr Protein Kinase
Mol. Mass.:41392.76
Organism:Homo sapiens (Human)
Description:P28482
Residue:360
BDBM204188
NameBDBM204188
Synonyms:US9242996, 262
TypeSmall organic molecule
Emp. Form.C26H22F5N5O2
Mol. Mass.531.4772
SMILESCc1c(cnn1C(F)F)-c1cnc(N)c(c1)-c1ccc(C(=O)N[C@H](CO)c2cc(F)cc(CF)c2)c(F)c1