Reaction Details
TargetMitogen-activated protein kinase 1
LigandBDBM204261
Substrate/Competitorn/a
Meas. Tech.ERK2 (20 pM) Kinase Assay
pH7.5±n/a
IC50 0.0208±n/a nM
Commentsextracted
Citation Bagdanoff, JTDing, YHan, WHuang, ZJiang, QJin, JXKou, XLee, PLindvall, MMin, ZPan, YPecchi, SPfister, KBPoon, DRauniyar, VWang, XMZhang, QZhou, JZhu, S Aminoheteroaryl benzamides as kinase inhibitors US Patent US9242996 Publication Date 1/26/2016
 
Mitogen-activated protein kinase 1
Name:Mitogen-activated protein kinase 1
Type:Ser/Thr Protein Kinase
Mol. Mass.:41392.76
Organism:Homo sapiens (Human)
Description:P28482
Residue:360
BDBM204261
NameBDBM204261
Synonyms:US9242996, 335
TypeSmall organic molecule
Emp. Form.C25H24F4N4O3
Mol. Mass.504.4767
SMILESNc1ncc(nc1-c1ccc(C(=O)N[C@H](CO)c2cc(F)cc(c2)C(F)F)c(F)c1)C1CCOCC1