Reaction Details
TargetMitogen-activated protein kinase 1
LigandBDBM204262
Substrate/Competitorn/a
Meas. Tech.ERK2 (20 pM) Kinase Assay
pH7.5±n/a
IC50 0.0143±n/a nM
Commentsextracted
Citation Bagdanoff, JTDing, YHan, WHuang, ZJiang, QJin, JXKou, XLee, PLindvall, MMin, ZPan, YPecchi, SPfister, KBPoon, DRauniyar, VWang, XMZhang, QZhou, JZhu, S Aminoheteroaryl benzamides as kinase inhibitors US Patent US9242996 Publication Date 1/26/2016
 
Mitogen-activated protein kinase 1
Name:Mitogen-activated protein kinase 1
Type:Ser/Thr Protein Kinase
Mol. Mass.:41392.76
Organism:Homo sapiens (Human)
Description:P28482
Residue:360
BDBM204262
NameBDBM204262
Synonyms:US9242996, 336
TypeSmall organic molecule
Emp. Form.C25H26ClF2N5O2
Mol. Mass.501.956
SMILESCNC[C@@H](NC(=O)c1ccc(cc1F)-c1nc(cnc1N)C1CCOCC1)c1cc(F)cc(Cl)c1