Reaction Details
TargetSerine/threonine-protein kinase B-raf
LigandBDBM205483
Substrate/Competitorn/a
Meas. Tech.Competitive Binding Assay (KINOMEscan)
Kd>10000±n/a nM
Citation Murphy, EACheresh, DAArnold, LD Therapeutic methods and compositions involving allosteric kinase inhibition US Patent US9260417 Publication Date 2/16/2016
 
Serine/threonine-protein kinase B-raf
Name:Serine/threonine-protein kinase B-raf
Type:Serine/threonine-protein kinase
Mol. Mass.:84446.00
Organism:Homo sapiens (Human)
Description:P15056
Residue:766
BDBM205483
NameBDBM205483
Synonyms:US9260417, 6
TypeSmall organic molecule
Emp. Form.C20H16F3N7OS
Mol. Mass.459.448
SMILESCSc1nc(N)cc(Oc2ccc(cc2)-c2nnc(Nc3cccc(c3)C(F)(F)F)[nH]2)n1