Reaction Details
TargetEphrin type-A receptor 2 [596-900]
LigandBDBM50100615
Substrate/Competitorn/a
Meas. Tech.HotSpot Kinase Activity Assay
IC50 13±0.0 nM
Citation Heinzlmeir, SKudlinzki, DSreeramulu, SKlaeger, SGande, SLLinhard, VWilhelm, MQiao, HHelm, DRuprecht, BSaxena, KMédard, GSchwalbe, HKuster, B Chemical Proteomics and Structural Biology Define EPHA2 Inhibition by Clinical Kinase Drugs. ACS Chem Biol11:3400-3411 (2016) 
 
Ephrin type-A receptor 2 [596-900]
Name:Ephrin type-A receptor 2 [596-900]
Type:Protein
Mol. Mass.:34367.96
Organism:Homo sapiens (Human)
Description:EPHA2 truncation (596-900 aa); 519U
Residue:305
BDBM50100615
NameBDBM50100615
Synonyms:E-7050 Golvatinib
TypeSmall organic molecule
Emp. Form.C33H37F2N7O4
Mol. Mass.633.6882
SMILESCN1CCN(CC1)C1CCN(CC1)C(=O)Nc1cc(Oc2ccc(NC(=O)C3(CC3)C(=O)Nc3ccc(F)cc3)c(F)c2)ccn1