Reaction Details
TargetTspO-like protein
LigandBDBM20192
Substrate/Competitorn/a
Meas. Tech.Tryptophan Fluorescence Assay
Kd 201600±n/a nM
Citation Busch, AWWareJoncas, ZMontgomery, BL Tryptophan-Rich Sensory Protein/Translocator Protein (TSPO) from Cyanobacterium Fremyella diplosiphon Binds a Broad Range of Functionally Relevant Tetrapyrroles. Biochemistry56:73-84 (2017) 
 
TspO-like protein
Name:TspO-like protein
Synonyms:Tryptophan-rich sensory protein/translocator protein (TSPO)
Type:Protein
Mol. Mass.:28330.64
Organism:Fremyella diplosiphon (Cyanobacterium)
Description:Q6GZK8
Residue:251
BDBM20192
NameBDBM20192
TypeSteroid
Emp. Form.C27H46O
Mol. Mass.386.6535
SMILES[H][C@@]1(CC[C@@]2([H])[C@]3([H])CC=C4C[C@@H](O)CC[C@]4(C)[C@@]3([H])CC[C@]12C)[C@H](C)CCCC(C)C