Reaction Details
TargetVitamin K epoxide reductase complex subunit 1-like protein 1
LigandBDBM50343352
Substrate/Competitorn/a
Meas. Tech.VKOR Activity Assay
pH7.4±n/a
Temperature310.15±n/a K
Ki 5.20e+4± 3.0e+3 nM
Commentsextracted
Citation Hammed, AMatagrin, BSpohn, GProuillac, CBenoit, ELattard, V VKORC1L1, an enzyme rescuing the vitamin K 2,3-epoxide reductase activity in some extrahepatic tissues during anticoagulation therapy. J Biol Chem288:28733-42 (2013) 
 
Vitamin K epoxide reductase complex subunit 1-like protein 1
Name:Vitamin K epoxide reductase complex subunit 1-like protein 1
Type:Enzyme
Mol. Mass.:19843.50
Organism:Homo sapiens (Human)
Description:Q8N0U8
Residue:176
BDBM50343352
NameBDBM50343352
Synonyms:2-hydroxy-3-(3-oxo-1-phenylbutyl)-4H-chromen-4-one 4-Hydroxy-3-(3-oxo-1-phenyl-butyl)-chromen-2-one CHEMBL1464 Jantoven wafarin warfarine
TypeSmall organic molecule
Emp. Form.C19H16O4
Mol. Mass.308.3279
SMILESCC(=O)CC(c1ccccc1)c1c(O)c2ccccc2oc1=O