Reaction Details
TargetHistone deacetylase 1
LigandBDBM50276074
Substrate/Competitorn/a
Meas. Tech.Enzymatic HDAC Activity Assay
pH7.5±n/a
IC50 7.93±n/a nM
Commentsextracted
Citation Lauffer, BEMintzer, RFong, RMukund, STam, CZilberleyb, IFlicke, BRitscher, AFedorowicz, GVallero, ROrtwine, DFGunzner, JModrusan, ZNeumann, LKoth, CMLupardus, PJKaminker, JSHeise, CESteiner, P Histone deacetylase (HDAC) inhibitor kinetic rate constants correlate with cellular histone acetylation but not transcription and cell viability. J Biol Chem288:26926-43 (2013) 
 
Histone deacetylase 1
Name:Histone deacetylase 1
Type:Enzyme
Mol. Mass.:55090.27
Organism:Homo sapiens (Human)
Description:Q13547
Residue:482
BDBM50276074
NameBDBM50276074
Synonyms:CHEMBL470791 N-(2-amino-5-(thiophen-2-yl)phenyl)-6-(1-oxo-2,7-diazaspiro[3.5]nonan-7-yl)nicotinamide
TypeSmall organic molecule
Emp. Form.C23H23N5O2S
Mol. Mass.433.526
SMILESNc1ccc(cc1NC(=O)c1ccc(nc1)N1CCC2(CNC2=O)CC1)-c1cccs1