Reaction Details
TargetHistone deacetylase 9
LigandBDBM50005711
Substrate/Competitorn/a
Meas. Tech.Enzymatic HDAC Activity Assay
pH7.5±n/a
IC50 3.7e+3±n/a nM
Commentsextracted
Citation Lauffer, BEMintzer, RFong, RMukund, STam, CZilberleyb, IFlicke, BRitscher, AFedorowicz, GVallero, ROrtwine, DFGunzner, JModrusan, ZNeumann, LKoth, CMLupardus, PJKaminker, JSHeise, CESteiner, P Histone deacetylase (HDAC) inhibitor kinetic rate constants correlate with cellular histone acetylation but not transcription and cell viability. J Biol Chem288:26926-43 (2013) 
 
Histone deacetylase 9
Name:Histone deacetylase 9
Type:Enzyme
Mol. Mass.:111304.31
Organism:Homo sapiens (Human)
Description:Q9UKV0
Residue:1011
BDBM50005711
NameBDBM50005711
Synonyms:CHEBI:46024 TRICHOSTATIN Trichostatin A (TSA) US10722597, Compound Trichostatin US20230322747, Compound trichostatin A | US9265734, TSA
TypeSmall organic molecule
Emp. Form.C17H22N2O3
Mol. Mass.302.3682
SMILESC[C@H](\C=C(/C)\C=C\C(=O)NO)C(=O)c1ccc(cc1)N(C)C