Reaction Details
TargetPutative lanosterol 14-alpha-demethylase
LigandBDBM213824
Substrate/Competitorn/a
Meas. Tech.CYP51 Inhibition Assay
pH7.4±n/a
Temperature310.15±n/a K
Kd 18± 1 nM
Commentsextracted
Citation Hargrove, TYWawrzak, ZAlexander, PWChaplin, JHKeenan, MCharman, SAPerez, CJWaterman, MRChatelain, ELepesheva, GI Complexes of Trypanosoma cruzi sterol 14a-demethylase (CYP51) with two pyridine-based drug candidates for Chagas disease: structural basis for pathogen selectivity. J Biol Chem288:31602-15 (2013) 
 
Putative lanosterol 14-alpha-demethylase
Name:Putative lanosterol 14-alpha-demethylase
Synonyms:Sterol 14α-demethylase (CYP51)
Type:Protein
Mol. Mass.:54162.02
Organism:Leishmania infantum
Description:A2TEF2
Residue:480
BDBM213824
NameBDBM213824
Synonyms:Posaconazole
TypeSmall organic molecule
Emp. Form.C37H42F2N8O4
Mol. Mass.700.7774
SMILESCC[C@@H]([C@H](C)O)n1ncn(-c2ccc(cc2)N2CCN(CC2)c2ccc(OCC3CO[C@](Cn4cncn4)(C3)c3ccc(F)cc3F)cc2)c1=O