Reaction Details
TargetLanosterol 14-alpha demethylase
LigandBDBM213823
Substrate/Competitorn/a
Meas. Tech.CYP51 Inhibition Assay
pH7.4±n/a
Temperature310.15±n/a K
Kd 69± 3 nM
Commentsextracted
Citation Hargrove, TYWawrzak, ZAlexander, PWChaplin, JHKeenan, MCharman, SAPerez, CJWaterman, MRChatelain, ELepesheva, GI Complexes of Trypanosoma cruzi sterol 14a-demethylase (CYP51) with two pyridine-based drug candidates for Chagas disease: structural basis for pathogen selectivity. J Biol Chem288:31602-15 (2013) 
 
Lanosterol 14-alpha demethylase
Name:Lanosterol 14-alpha demethylase
Type:Protein
Mol. Mass.:56817.21
Organism:Homo sapiens (Human)
Description:Q16850
Residue:509
BDBM213823
NameBDBM213823
Synonyms:EPL-BS1246 (UDO)
TypeSmall organic molecule
Emp. Form.C24H21ClF3N3O
Mol. Mass.459.891
SMILESFC(F)(F)c1ccc(cc1)N1CCN(CC1)C(=O)[C@@H](c1ccc(Cl)cc1)c1cccnc1