Reaction Details
TargetThyroid peroxidase
LigandBDBM50015089
Substrate/Competitorn/a
Meas. Tech.LPO/TPO Selectivity Assay
IC50 2.00e+3± 4e+1 nM
Citation Forbes, LVSjögren, TAuchère, FJenkins, DWThong, BLaughton, DHemsley, PPairaudeau, GTurner, REriksson, HUnitt, JFKettle, AJ Potent reversible inhibition of myeloperoxidase by aromatic hydroxamates. J Biol Chem288:36636-47 (2013) 
 
Thyroid peroxidase
Name:Thyroid peroxidase
Type:Enzyme
Mol. Mass.:102965.07
Organism:Homo sapiens (Human)
Description:P07202
Residue:933
BDBM50015089
NameBDBM50015089
Synonyms:2,N-Dihydroxy-benzamide N,2-dihydroxybenzamide Salicylhydroxamic acid (SHA) US11565996, Compound Salicylhydroxamic acid (SHAM)
TypeSmall organic molecule
Emp. Form.C7H7NO3
Mol. Mass.153.1354
SMILESONC(=O)c1ccccc1O