Reaction Details
TargetLactoperoxidase
LigandBDBM217355
Substrate/Competitorn/a
Meas. Tech.LPO/TPO Selectivity Assay
IC50 40± 1 nM
Citation Forbes, LVSjögren, TAuchère, FJenkins, DWThong, BLaughton, DHemsley, PPairaudeau, GTurner, REriksson, HUnitt, JFKettle, AJ Potent reversible inhibition of myeloperoxidase by aromatic hydroxamates. J Biol Chem288:36636-47 (2013) 
 
Lactoperoxidase
Name:Lactoperoxidase
Type:Enzyme
Mol. Mass.:80659.97
Organism:Bos taurus (Bovine)
Description:P80025
Residue:712
BDBM217355
NameBDBM217355
Synonyms:4-benzyl-2-hydroxybenzenecarbohydroxamic acid (HX2)
TypeSmall organic molecule
Emp. Form.C14H13NO3
Mol. Mass.243.2579
SMILESONC(=O)c1ccc(Cc2ccccc2)cc1O