Reaction Details
Target(S)-6-hydroxynicotine oxidase [N166A]
LigandBDBM217378
Substrate/Competitorn/a
Meas. Tech.Steady-State Kinetic Assay
pH8±0
Temperature571.3±0 K
Kd 3.10e+5± 5.0e+4 nM
Citation Fitzpatrick, PFChadegani, FZhang, SDougherty, V Mechanism of Flavoprotein l-6-Hydroxynicotine Oxidase: pH and Solvent Isotope Effects and Identification of Key Active Site Residues. Biochemistry56:869-875 (2017) 
 
(S)-6-hydroxynicotine oxidase [N166A]
Name:(S)-6-hydroxynicotine oxidase [N166A]
Type:Enzyme
Mol. Mass.:46274.19
Organism:Arthrobacter nicotinovorans
Description:A. nicotinovorans LHNO N166A mutant
Residue:425
BDBM217378
NameBDBM217378
Synonyms:(S)-6-hydroxynicotine | 5-[(2S)-1-methylpyrrolidin-2-yl]-1H-pyridin-2-one
TypeSmall organic molecule
Emp. Form.C10H14N2O
Mol. Mass.178.231
SMILESCN1CCC[C@H]1c1ccc(=O)[nH]c1