Reaction Details
TargetTyrosine-protein kinase BTK
LigandBDBM191617
Substrate/Competitorn/a
Meas. Tech.In Vitro HotSpot Kinase Assay
IC50 0.67±n/a nM
Citation Honigberg, LVerner, EBuggy, JLoury, DChen, W Inhibitors of bruton's tyrosine kinase for the treatment of solid tumors US Patent US9278100 Publication Date 3/8/2016
 
Tyrosine-protein kinase BTK
Name:Tyrosine-protein kinase BTK
Type:Enzyme
Mol. Mass.:76289.95
Organism:Homo sapiens (Human)
Description:Q06187
Residue:659
BDBM191617
NameBDBM191617
Synonyms:US9181263, 13 | US9278100, 13
TypeSmall organic molecule
Emp. Form.C25H24N6O2
Mol. Mass.440.4971
SMILESNc1ncnc2n(C[C@H]3CCCN3C(=O)C=C)nc(-c3ccc(Oc4ccccc4)cc3)c12