Reaction Details
TargetEpidermal growth factor receptor
LigandBDBM191609
Substrate/Competitorn/a
Meas. Tech.In Vitro HotSpot Kinase Assay
IC50 74.5±n/a nM
Citation Honigberg, LVerner, EBuggy, JLoury, DChen, W Inhibitors of bruton's tyrosine kinase for the treatment of solid tumors US Patent US9278100 Publication Date 3/8/2016
 
Epidermal growth factor receptor
Name:Epidermal growth factor receptor
Type:Receptor Kinase Domain
Mol. Mass.:134279.59
Organism:Homo sapiens (Human)
Description:P00533
Residue:1210
BDBM191609
NameBDBM191609
Synonyms:US9181263, 3 | US9278100, 3
TypeSmall organic molecule
Emp. Form.C29H33N7O3
Mol. Mass.527.6174
SMILESCN(CCO)C\C=C\C(=O)N1CCCC(C1)n1nc(-c2ccc(Oc3ccccc3)cc2)c2c(N)ncnc12